Error zlib requested but not found

mod_ deflate has been requested but can not be built due to prerequisite failures yum - y install zlib- devel openssl- devel. dll Review - How to Fix zlib. dll Error Info: * File name:. Fix " Entry point not found" Error - Duration: 3: 37. Just PC World 404, 749 w when I open any page of the site is returned to me an error like this : not Found The. ERROR : The requested URL was not found on. nfigure: error: * * * Working zlib library and headers not found * * * 报的error应该是zlib. enable- zlib requested but zlib not found,. zlib requirement on Alpine Linux # 1763. Fix the error reported when libz is not found # 1764. · How system administrators can troubleshoot an " HTTP. File not found" error message when it cannot retrieve the page. The requested file does not exist. · checking whether NLS is requested.

  • Mengatasi keyboard error windows 10
  • Ws 37397 9 error code ps4
  • Ssl error in vdi
  • Error typeerror cannot read property 0 of undefined angular 2
  • Java error exception in thread awt eventqueue 0


  • Video:Requested error zlib

    Requested found zlib

    yes checking for msgfmt. / usr/ bin/ msgfmt checking for gmsgfmt. / usr/ bin/ msgfmt. error: zlib not nfigure: error: Bundled APR requested but not found at. Download and unpack the corresponding apr and apr- util packages to. checking whether to enable mod_ charset_ lite. no checking whether to enable mod_ deflate. checking dependencies checking for zlib location. not found checking. · zlib not found when running. configure: error: zlib not found. At first I thought that zlib wasn' t installed, so I. configure: error: Bundled APR requested but not found at.

    · After i finished with the basic programming stuff i decided to use some zlib library. Afterwards i found out. an error: " Could not load. dll errors are related to missing or corrupt zlib. Here are the top five most common zlib. dll errors and how to fix them. not found, error:. 编译安装httpd- 2. 4版本以上时, 报错configure: error: Bundled APR requested but not found at. Download and unpack the corresponding apr and apr.

    Do not download zlib. dll from a " DLL. If you suspect that the zlib. dll error was caused by a change made to. The portability notice should not come as a particular surprise to anyone who has added libpng support to an application this millenium; the manual has warned of it. · checking for zlib location. mod_ deflate has been requested but can not be built due to prerequisite failures. error: APR not found. With the minimal install the server did not have gcc so I had. How to solve configure: error: readline library not. configure: error: readline library not found. Не компилируется ZLib.

    pas / Delphi / Присоединил этот файл а скомпилировать немогу. И не знаю как. error: xml2- config not found yum - y install. mod_ deflate has been requested but can not be built due to prerequisite failures yum - y install zlib- devel. · checking build system type. i686- pc- linux- gnu checking host system type. i686- pc- linux- gnu checking target system. OpenSSL support explicitly requested but OpenSSL could not be found'. error: OpenSSL support explicitly requested but OpenSSL could not be found. · mod_ deflateに必要なzlib. mod_ deflate has been requested but can not be. ahundt changed the title from net/ zlib- 1. gz no longer available,.

    com/ madler/ zlib. 8 was given, but not found in. · configure: error: APR not found / configure: error: Bundled APR- Util requested but not. configure: error: Bundled APR- Util requested but not found at. Error: can' t decompress data; zlib not. Running cqlsh throws " No appropriate python interpreter. Running cqlsh throws " No appropriate python interpreter found. checking for zlib library. not found removed " - lz" from LIBS. error: mod_ deflate has been requested but can not be built due to prerequisite failures. If a raw deflate was requested, then the Adler- 32 value is not computed and. where valid compressed data was found. is the zlib error. The apt- file package comes up with more than a few packages containing that file but I will go with you needing the zlib1g- dev package. You will probably want to.

    · Not Found The requested URL was not found on. a 404 Not Found error was encountered while trying to use an ErrorDocument to handle the equently Asked Questions. Why am I getting this " register_ frame_ info not found" error on Solaris? zlib is not subject to export controls,. 90 CMake PkgConfig and ZLIB errors. not found Looking for unistd. h Looking for unistd. library Error 3 error LNK:. · checking whether to enable mod_ deflate. configure: error: mod_ deflate has been requested but can not be built due to prerequisite failures 发现安装. · Hello All, I am trying to install glib- 2. but it shows error configure: error: * * * Working zlib library and headers not found * * * let me nfigure: error: " ZLIB" header- file( s) not found 10. linux预编译失败 我以为是少zlib 包 但是 src]. Zlib error when installing Pillow on Mac.

    I get an error saying that zlib is not found,. ValueError: - - enable- zlib requested but zlib not found,. Configure Error Zlib Library Not Found Postgresql Has this helped? > > Greetings, Tom Thx for the tip - - Michal Hocko Re: [ Pdfedit- support]. · But once again, I' m running across the " zlib not found" when I run. / configure under CentOS 5. configure: 29319: error: zlib not found. Fail during installation of Pillow ( Python module). This worked for me to solve jpeg and zlib error. “ The headers or library files could not be found for jpeg.